Reaction Details
TargetDual specificity protein phosphatase 3
LigandBDBM46211
Substrate/Competitorn/a
Meas. Tech.Fluorescent assay for identification of compounds that inhibit VHR1
IC50 3490±n/a nM
Citation PubChem, PC Fluorescent assay for identification of compounds that inhibit VHR1 PubChem Bioassay(2009)[AID]
 
Dual specificity protein phosphatase 3
Name:Dual specificity protein phosphatase 3
Type:Hydrolase
Mol. Mass.:20480.58
Organism:Homo sapiens (Human)
Description:n/a
Residue:185
BDBM46211
NameBDBM46211
Synonyms:1-cyclohexyl-3-(4-sulfamoylphenyl)thiourea cid_892446
TypeSmall organic molecule
Emp. Form.C13H19N3O2S2
Mol. Mass.313.439
SMILESNS(=O)(=O)c1ccc(NC(=S)NC2CCCCC2)cc1