Reaction Details
TargetDual specificity protein phosphatase 3
LigandBDBM43224
Substrate/Competitorn/a
Meas. Tech.Fluorescent assay for identification of compounds that inhibit VHR1
IC50 106000±n/a nM
Citation PubChem, PC Fluorescent assay for identification of compounds that inhibit VHR1 PubChem Bioassay(2009)[AID]
 
Dual specificity protein phosphatase 3
Name:Dual specificity protein phosphatase 3
Type:Hydrolase
Mol. Mass.:20480.58
Organism:Homo sapiens (Human)
Description:n/a
Residue:185
BDBM43224
NameBDBM43224
Synonyms:1-ethyl-6-methyl-3-[(E)-2-phenylethenyl]pyrimido[5,4-e][1,2,4]triazine-5,7-dione MLS000717146 US9073941, 609 | cid_5756371
TypeSmall organic molecule
Emp. Form.C16H15N5O2
Mol. Mass.309.3226
SMILESCCn1nc(\C=C\c2ccccc2)nc2c1nc(=O)n(C)c2=O