Reaction Details
TargetDual specificity protein phosphatase 3
LigandBDBM46224
Substrate/Competitorn/a
Meas. Tech.Fluorescent assay for identification of compounds that inhibit VHR1
IC50 3930±n/a nM
Citation PubChem, PC Fluorescent assay for identification of compounds that inhibit VHR1 PubChem Bioassay(2009)[AID]
 
Dual specificity protein phosphatase 3
Name:Dual specificity protein phosphatase 3
Type:Hydrolase
Mol. Mass.:20480.58
Organism:Homo sapiens (Human)
Description:n/a
Residue:185
BDBM46224
NameBDBM46224
Synonyms:2-[2-bromanyl-4-[(Z)-[2-[(4-ethylphenyl)amino]-4-oxidanylidene-1,3-thiazol-5-ylidene]methyl]-6-methoxy-phenoxy]ethanoic acid 2-[2-bromo-4-[(Z)-[2-(4-ethylanilino)-4-oxo-1,3-thiazol-5-ylidene]methyl]-6-methoxyphenoxy]acetic acid MLS-0343544.0001 | cid_5765581
TypeSmall organic molecule
Emp. Form.C21H19BrN2O5S
Mol. Mass.491.355
SMILESCCc1ccc(NC2=NC(=O)C(S2)=Cc2cc(Br)c(OCC(O)=O)c(OC)c2)cc1