Reaction Details
TargetDual specificity protein phosphatase 3
LigandBDBM46207
Substrate/Competitorn/a
Meas. Tech.Fluorescent assay for identification of compounds that inhibit VHR1
IC50 1880±n/a nM
Citation PubChem, PC Fluorescent assay for identification of compounds that inhibit VHR1 PubChem Bioassay(2009)[AID]
 
Dual specificity protein phosphatase 3
Name:Dual specificity protein phosphatase 3
Type:Hydrolase
Mol. Mass.:20480.58
Organism:Homo sapiens (Human)
Description:n/a
Residue:185
BDBM46207
NameBDBM46207
Synonyms:4-[[5-(4-bromophenyl)-2-furoyl]thiocarbamoylamino]benzoic acid 4-[[5-(4-bromophenyl)furan-2-yl]carbonylcarbamothioylamino]benzoic acid MLS-0383777.0001 | cid_1328767
TypeSmall organic molecule
Emp. Form.C19H13BrN2O4S
Mol. Mass.445.287
SMILESOC(=O)c1ccc(NC(=S)NC(=O)c2ccc(o2)-c2ccc(Br)cc2)cc1