Reaction Details
TargetMitogen-activated protein kinase kinase kinase kinase 2
LigandBDBM51851
Substrate/Competitorn/a
Meas. Tech.Dose Response Confirmation via Multiplex HTS Assay for Inhibitors of MEK Kinase PB1 Domains, specifically MEK5 binding to MEK Kinase 2 Wildtype
EC50 1480±n/a nM
Citation PubChem, PC Dose Response Confirmation via Multiplex HTS Assay for Inhibitors of MEK Kinase PB1 Domains, specifically MEK5 binding to MEK Kinase 2 Wildtype PubChem Bioassay(2009)[AID]
 
Mitogen-activated protein kinase kinase kinase kinase 2
Name:Mitogen-activated protein kinase kinase kinase kinase 2
Type:n/a
Mol. Mass.:91551.35
Organism:Homo sapiens (Human)
Description:n/a
Residue:820
BDBM51851
NameBDBM51851
Synonyms:(5S)-4-[2-(3,4-dichlorophenyl)ethyl]-1-[(1R)-5-[methyl(p-anisyl)amino]-1-[(p-anisylamino)methyl]pentyl]-5-phenyl-piperazine-2,3-quinone (5S)-4-[2-(3,4-dichlorophenyl)ethyl]-1-[(2R)-1-[(4-methoxyphenyl)methylamino]-6-[(4-methoxyphenyl)methyl-methylamino]hexan-2-yl]-5-phenylpiperazine-2,3-dione SMR000386382 | cid_16195670
TypeSmall organic molecule
Emp. Form.C41H48Cl2N4O4
Mol. Mass.731.75
SMILESCOc1ccc(CNC[C@@H](CCCCN(C)Cc2ccc(OC)cc2)N2C[C@@H](N(CCc3ccc(Cl)c(Cl)c3)C(=O)C2=O)c2ccccc2)cc1