Reaction Details
TargetMitogen-activated protein kinase kinase kinase kinase 2
LigandBDBM51861
Substrate/Competitorn/a
Meas. Tech.Dose Response Confirmation via Multiplex HTS Assay for Inhibitors of MEK Kinase PB1 Domains, specifically MEK5 binding to MEK Kinase 2 Wildtype
EC50 6900±n/a nM
Citation PubChem, PC Dose Response Confirmation via Multiplex HTS Assay for Inhibitors of MEK Kinase PB1 Domains, specifically MEK5 binding to MEK Kinase 2 Wildtype PubChem Bioassay(2009)[AID]
 
Mitogen-activated protein kinase kinase kinase kinase 2
Name:Mitogen-activated protein kinase kinase kinase kinase 2
Type:n/a
Mol. Mass.:91551.35
Organism:Homo sapiens (Human)
Description:n/a
Residue:820
BDBM51861
NameBDBM51861
Synonyms:IW-LK SMR000391065 | cid_16196530
TypeSmall organic molecule
Emp. Form.C51H79ClN18O5
Mol. Mass.1059.744
SMILESCl.CCC(C)[C@H](N)c1cn(nn1)[C@@H](Cc1cc2ccccc2[nH]1)C(=O)N1CCN(CC1)c1nc(NCCOCCOCCOCC#C)nc(n1)N1CCN(CC1)C(=O)[C@H](CCCCN)n1cc(nn1)[C@@H](N)CC(C)C