Reaction Details
TargetMitogen-activated protein kinase kinase kinase kinase 2
LigandBDBM51873
Substrate/Competitorn/a
Meas. Tech.Dose Response Confirmation via Multiplex HTS Assay for Inhibitors of MEK Kinase PB1 Domains, specifically MEK5 binding to MEK Kinase 2 Wildtype
EC50 6120±n/a nM
Citation PubChem, PC Dose Response Confirmation via Multiplex HTS Assay for Inhibitors of MEK Kinase PB1 Domains, specifically MEK5 binding to MEK Kinase 2 Wildtype PubChem Bioassay(2009)[AID]
 
Mitogen-activated protein kinase kinase kinase kinase 2
Name:Mitogen-activated protein kinase kinase kinase kinase 2
Type:n/a
Mol. Mass.:91551.35
Organism:Homo sapiens (Human)
Description:n/a
Residue:820
BDBM51873
NameBDBM51873
Synonyms:MLS000562837 YW-LY | cid_16196610
TypeSmall organic molecule
Emp. Form.C57H74ClN17O7
Mol. Mass.1144.76
SMILESCl.CC(C)CC(N)c1cn(nn1)C(Cc1ccc(O)cc1)C(=O)N1CCN(CC1)c1nc(NCCOCCOCCOCC#C)nc(n1)N1CCN(CC1)C(=O)C(Cc1cc2ccccc2[nH]1)n1cc(nn1)C(N)Cc1ccc(O)cc1