Reaction Details
TargetMitogen-activated protein kinase kinase kinase kinase 2
LigandBDBM45687
Substrate/Competitorn/a
Meas. Tech.Dose Response Confirmation via Multiplex HTS Assay for Inhibitors of MEK Kinase PB1 Domains, specifically MEK5 binding to MEK Kinase 2 Wildtype
EC50 3370±n/a nM
Citation PubChem, PC Dose Response Confirmation via Multiplex HTS Assay for Inhibitors of MEK Kinase PB1 Domains, specifically MEK5 binding to MEK Kinase 2 Wildtype PubChem Bioassay(2009)[AID]
 
Mitogen-activated protein kinase kinase kinase kinase 2
Name:Mitogen-activated protein kinase kinase kinase kinase 2
Type:n/a
Mol. Mass.:91551.35
Organism:Homo sapiens (Human)
Description:n/a
Residue:820
BDBM45687
NameBDBM45687
Synonyms:MLS000779368 SMR000416082 | cid_1919081
TypeSmall organic molecule
Emp. Form.C23H25N5S
Mol. Mass.403.543
SMILESCN(C)CCNc1ncnc2c1sc1nc(-c3ccccc3)c3CCCCc3c21