Reaction Details
TargetMitogen-activated protein kinase kinase kinase kinase 2
LigandBDBM51878
Substrate/Competitorn/a
Meas. Tech.Dose Response Confirmation via Multiplex HTS Assay for Inhibitors of MEK Kinase PB1 Domains, specifically MEK5 binding to MEK Kinase 2 Wildtype
EC50 9160±n/a nM
Citation PubChem, PC Dose Response Confirmation via Multiplex HTS Assay for Inhibitors of MEK Kinase PB1 Domains, specifically MEK5 binding to MEK Kinase 2 Wildtype PubChem Bioassay(2009)[AID]
 
Mitogen-activated protein kinase kinase kinase kinase 2
Name:Mitogen-activated protein kinase kinase kinase kinase 2
Type:n/a
Mol. Mass.:91551.35
Organism:Homo sapiens (Human)
Description:n/a
Residue:820
BDBM51878
NameBDBM51878
Synonyms:2,6-bis(iodanyl)-4-[2-(1,3,3-trimethylindol-2-ylidene)ethenyl]phenol 2,6-diiodo-4-[2-(1,3,3-trimethylindol-2-ylidene)ethenyl]phenol MLS000737639 cid_233331
TypeSmall organic molecule
Emp. Form.C19H17I2NO
Mol. Mass.529.1533
SMILESCN1C(=C=Cc2cc(I)c(O)c(I)c2)C(C)(C)c2ccccc12