Reaction Details
TargetMitogen-activated protein kinase kinase kinase kinase 2
LigandBDBM50174412
Substrate/Competitorn/a
Meas. Tech.Dose Response Confirmation via Multiplex HTS Assay for Inhibitors of MEK Kinase PB1 Domains, specifically MEK5 binding to MEK Kinase 2 Wildtype
EC50 30000±n/a nM
Citation PubChem, PC Dose Response Confirmation via Multiplex HTS Assay for Inhibitors of MEK Kinase PB1 Domains, specifically MEK5 binding to MEK Kinase 2 Wildtype PubChem Bioassay(2009)[AID]
 
Mitogen-activated protein kinase kinase kinase kinase 2
Name:Mitogen-activated protein kinase kinase kinase kinase 2
Type:n/a
Mol. Mass.:91551.35
Organism:Homo sapiens (Human)
Description:n/a
Residue:820
BDBM50174412
NameBDBM50174412
Synonyms:9-Methoxy-5,11-dimethyl-6H-pyrido[4,3-b]carbazole 9-methoxy ellipticine CHEMBL19954 cid_72512
TypeSmall organic molecule
Emp. Form.C18H16N2O
Mol. Mass.276.3324
SMILESCOc1ccc2[nH]c3c(C)c4ccncc4c(C)c3c2c1