Reaction Details
TargetMitogen-activated protein kinase kinase kinase kinase 2
LigandBDBM51887
Substrate/Competitorn/a
Meas. Tech.Dose Response Confirmation via Multiplex HTS Assay for Inhibitors of MEK Kinase PB1 Domains, specifically MEK5 binding to MEK Kinase 2 Wildtype
EC50 7740±n/a nM
Citation PubChem, PC Dose Response Confirmation via Multiplex HTS Assay for Inhibitors of MEK Kinase PB1 Domains, specifically MEK5 binding to MEK Kinase 2 Wildtype PubChem Bioassay(2009)[AID]
 
Mitogen-activated protein kinase kinase kinase kinase 2
Name:Mitogen-activated protein kinase kinase kinase kinase 2
Type:n/a
Mol. Mass.:91551.35
Organism:Homo sapiens (Human)
Description:n/a
Residue:820
BDBM51887
NameBDBM51887
Synonyms:LIW-LI SMR000391049 | cid_16745364
TypeSmall organic molecule
Emp. Form.C51H78ClN17O5
Mol. Mass.1044.729
SMILESCl.CC[C@H](C)[C@@H](C(=O)N1CCN(CC1)c1nc(NCCOCCOCCOCC#C)nc(n1)N1CCN(CC1)C(=O)[C@H](Cc1cc2ccccc2[nH]1)n1cc(nn1)[C@@H](N)CC(C)C)n1cc(nn1)[C@@H](N)CC(C)C