Reaction Details
TargetMitogen-activated protein kinase kinase kinase kinase 2
LigandBDBM51919
Substrate/Competitorn/a
Meas. Tech.Dose Response Confirmation via Multiplex HTS Assay for Inhibitors of MEK Kinase PB1 Domains, specifically MEK5 binding to MEK Kinase 2 Wildtype
EC50 30000±n/a nM
Citation PubChem, PC Dose Response Confirmation via Multiplex HTS Assay for Inhibitors of MEK Kinase PB1 Domains, specifically MEK5 binding to MEK Kinase 2 Wildtype PubChem Bioassay(2009)[AID]
 
Mitogen-activated protein kinase kinase kinase kinase 2
Name:Mitogen-activated protein kinase kinase kinase kinase 2
Type:n/a
Mol. Mass.:91551.35
Organism:Homo sapiens (Human)
Description:n/a
Residue:820
BDBM51919
NameBDBM51919
Synonyms:1-(2-methylphenoxy)-3-[[4-[[3-(2-methylphenoxy)-2-oxidanyl-propyl]amino]cyclohexyl]amino]propan-2-ol 1-[[4-[[2-hydroxy-3-(2-methylphenoxy)propyl]amino]cyclohexyl]amino]-3-(2-methylphenoxy)propan-2-ol SMR000588219 | cid_3629945
TypeSmall organic molecule
Emp. Form.C26H38N2O4
Mol. Mass.442.5909
SMILESCc1ccccc1OCC(O)CNC1CCC(CC1)NCC(O)COc1ccccc1C