Reaction Details
TargetBeta-lactamase
LigandBDBM51971
Substrate/Competitorn/a
Meas. Tech.Epi-absorbance-based dose response biochemical high throughput screening assay for selective inhibitors of VIM-2 metallo-beta-lactamase
IC50 5455±n/a nM
Citation PubChem, PC Epi-absorbance-based dose response biochemical high throughput screening assay for selective inhibitors of VIM-2 metallo-beta-lactamase PubChem Bioassay(2009)[AID]
 
Beta-lactamase
Name:Beta-lactamase
Synonyms:Beta lactamase
Type:Enzyme Catalytic Domain
Mol. Mass.:31513.38
Organism:Pseudomonas aeruginosa
Description:gi_114881106
Residue:286
BDBM51971
NameBDBM51971
TypeSmall organic molecule
Emp. Form.C14H13N3OS2
Mol. Mass.303.403
SMILESCn1c(n[nH]c1=S)-c1sccc1OCc1ccccc1