Reaction Details
TargetBeta-lactamase
LigandBDBM52007
Substrate/Competitorn/a
Meas. Tech.Epi-absorbance-based dose response biochemical high throughput screening assay for selective inhibitors of VIM-2 metallo-beta-lactamase
IC50 748±n/a nM
Citation PubChem, PC Epi-absorbance-based dose response biochemical high throughput screening assay for selective inhibitors of VIM-2 metallo-beta-lactamase PubChem Bioassay(2009)[AID]
 
Beta-lactamase
Name:Beta-lactamase
Synonyms:Beta lactamase
Type:Enzyme Catalytic Domain
Mol. Mass.:31513.38
Organism:Pseudomonas aeruginosa
Description:gi_114881106
Residue:286
BDBM52007
NameBDBM52007
TypeSmall organic molecule
Emp. Form.C12H10AsNO5
Mol. Mass.323.1331
SMILESO[As](O)(=O)c1cc(ccc1-c1ccccc1)[N+]([O-])=O