Reaction Details
TargetBeta-lactamase
LigandBDBM51971
Substrate/Competitorn/a
Meas. Tech.Epi-absorbance-based counterscreen for selective VIM-2 inhibitors: dose response biochemical high throughput screening assay to identify inhibitors of IMP-1 metallo-beta-lactamase.
IC50 59640±n/a nM
Citation PubChem, PC Epi-absorbance-based counterscreen for selective VIM-2 inhibitors: dose response biochemical high throughput screening assay to identify inhibitors of IMP-1 metallo-beta-lactamase. PubChem Bioassay(2009)[AID]
 
Beta-lactamase
Name:Beta-lactamase
Type:Enzyme Catalytic Domain
Mol. Mass.:27125.88
Organism:Pseudomonas aeruginosa
Description:gi_27368096
Residue:246
BDBM51971
NameBDBM51971
Synonyms:3-(3-benzoxy-2-thienyl)-4-methyl-1H-1,2,4-triazole-5-thione 4-methyl-3-(3-phenylmethoxythiophen-2-yl)-1H-1,2,4-triazole-5-thione MLS000325718 cid_1482495
TypeSmall organic molecule
Emp. Form.C14H13N3OS2
Mol. Mass.303.403
SMILESCn1c(n[nH]c1=S)-c1sccc1OCc1ccccc1