Reaction Details
TargetBeta-lactamase
LigandBDBM40973
Substrate/Competitorn/a
Meas. Tech.FRET-based counterscreen for selective VIM-2 inhibitors: dose response biochemical high throughput screening assay to identify epi-absorbance assay artifacts.
IC50 862±n/a nM
Citation PubChem, PC FRET-based counterscreen for selective VIM-2 inhibitors: dose response biochemical high throughput screening assay to identify epi-absorbance assay artifacts. PubChem Bioassay(2009)[AID]
 
Beta-lactamase
Name:Beta-lactamase
Synonyms:Beta lactamase
Type:Enzyme Catalytic Domain
Mol. Mass.:31513.38
Organism:Pseudomonas aeruginosa
Description:gi_114881106
Residue:286
BDBM40973
NameBDBM40973
TypeSmall organic molecule
Emp. Form.C17H22O8P2
Mol. Mass.416.2993
SMILESOP(O)(=O)c1ccccc1OCCCCCOc1ccccc1P(O)(O)=O