Reaction Details
TargetBeta-lactamase
LigandBDBM51963
Substrate/Competitorn/a
Meas. Tech.FRET-based counterscreen for selective VIM-2 inhibitors: dose response biochemical high throughput screening assay to identify epi-absorbance assay artifacts.
IC50 1964±n/a nM
Citation PubChem, PC FRET-based counterscreen for selective VIM-2 inhibitors: dose response biochemical high throughput screening assay to identify epi-absorbance assay artifacts. PubChem Bioassay(2009)[AID]
 
Beta-lactamase
Name:Beta-lactamase
Synonyms:Beta lactamase
Type:Enzyme Catalytic Domain
Mol. Mass.:31513.38
Organism:Pseudomonas aeruginosa
Description:gi_114881106
Residue:286
BDBM51963
NameBDBM51963
TypeSmall organic molecule
Emp. Form.C15H18FN3OS2
Mol. Mass.339.451
SMILESCC(C)(C)C(=O)Nc1nnc(CSCc2ccccc2F)s1