Reaction Details
TargetBeta-lactamase
LigandBDBM51970
Substrate/Competitorn/a
Meas. Tech.FRET-based counterscreen for selective VIM-2 inhibitors: dose response biochemical high throughput screening assay to identify epi-absorbance assay artifacts.
IC50 1460±n/a nM
Citation PubChem, PC FRET-based counterscreen for selective VIM-2 inhibitors: dose response biochemical high throughput screening assay to identify epi-absorbance assay artifacts. PubChem Bioassay(2009)[AID]
 
Beta-lactamase
Name:Beta-lactamase
Synonyms:Beta lactamase
Type:Enzyme Catalytic Domain
Mol. Mass.:31513.38
Organism:Pseudomonas aeruginosa
Description:gi_114881106
Residue:286
BDBM51970
NameBDBM51970
TypeSmall organic molecule
Emp. Form.C16H20N4O5
Mol. Mass.348.3538
SMILESCOc1cc(OC)c(C=NNC(=O)Cc2c(C)[nH][nH]c2=O)cc1OC