Reaction Details
TargetBeta-lactamase
LigandBDBM51989
Substrate/Competitorn/a
Meas. Tech.FRET-based counterscreen for selective VIM-2 inhibitors: dose response biochemical high throughput screening assay to identify epi-absorbance assay artifacts.
IC50 774±n/a nM
Citation PubChem, PC FRET-based counterscreen for selective VIM-2 inhibitors: dose response biochemical high throughput screening assay to identify epi-absorbance assay artifacts. PubChem Bioassay(2009)[AID]
 
Beta-lactamase
Name:Beta-lactamase
Synonyms:Beta lactamase
Type:Enzyme Catalytic Domain
Mol. Mass.:31513.38
Organism:Pseudomonas aeruginosa
Description:gi_114881106
Residue:286
BDBM51989
NameBDBM51989
TypeSmall organic molecule
Emp. Form.C14H11Cl2N3OS2
Mol. Mass.372.293
SMILESCn1c(n[nH]c1=S)-c1sccc1OCc1ccc(Cl)cc1Cl