Reaction Details
TargetBeta-lactamase
LigandBDBM52025
Substrate/Competitorn/a
Meas. Tech.FRET-based counterscreen for selective VIM-2 inhibitors: dose response biochemical high throughput screening assay to identify epi-absorbance assay artifacts.
IC50 433.08±n/a nM
Citation PubChem, PC FRET-based counterscreen for selective VIM-2 inhibitors: dose response biochemical high throughput screening assay to identify epi-absorbance assay artifacts. PubChem Bioassay(2009)[AID]
 
Beta-lactamase
Name:Beta-lactamase
Synonyms:Beta lactamase
Type:Enzyme Catalytic Domain
Mol. Mass.:31513.38
Organism:Pseudomonas aeruginosa
Description:gi_114881106
Residue:286
BDBM52025
NameBDBM52025
TypeSmall organic molecule
Emp. Form.C21H16N2O7
Mol. Mass.408.3609
SMILESCOc1ccc2[nH]c(C(O)=O)c(CCN3C(=O)c4ccc(cc4C3=O)C(O)=O)c2c1