Reaction Details
TargetZinc finger protein mex-5
LigandBDBM32020
Substrate/Competitorn/a
Meas. Tech.Fluorescent Polarization Homogeneous Dose Response HTS to Indentify Inhibitors of Mex-5 Binding to TCR-2
EC50 8755±n/a nM
Citation PubChem, PC Fluorescent Polarization Homogeneous Dose Response HTS to Indentify Inhibitors of Mex-5 Binding to TCR-2 PubChem Bioassay(2009)[AID]
 
Zinc finger protein mex-5
Name:Zinc finger protein mex-5
Type:Enzyme Catalytic Domain
Mol. Mass.:52832.78
Organism:Caenorhabditis elegans
Description:gi_55976631
Residue:468
BDBM32020
NameBDBM32020
Synonyms:4-[4-(3,4-dihydroxyphenyl)-2,3-dimethyl-butyl]pyrocatechol 4-[4-[3,4-bis(oxidanyl)phenyl]-2,3-dimethyl-butyl]benzene-1,2-diol CHEMBL52 MLS000069451 Nordihydroguaiaretic acid (NDGA) US10857082, Compound 2.18 | cid_4534
TypeSmall organic molecule
Emp. Form.C18H22O4
Mol. Mass.302.3649
SMILESCC(Cc1ccc(O)c(O)c1)C(C)Cc1ccc(O)c(O)c1