Reaction Details
TargetZinc finger protein mex-5
LigandBDBM52468
Substrate/Competitorn/a
Meas. Tech.Fluorescent Polarization Homogeneous Dose Response HTS to Indentify Inhibitors of Mex-5 Binding to TCR-2
EC50 41364±n/a nM
Citation PubChem, PC Fluorescent Polarization Homogeneous Dose Response HTS to Indentify Inhibitors of Mex-5 Binding to TCR-2 PubChem Bioassay(2009)[AID]
 
Zinc finger protein mex-5
Name:Zinc finger protein mex-5
Type:Enzyme Catalytic Domain
Mol. Mass.:52832.78
Organism:Caenorhabditis elegans
Description:gi_55976631
Residue:468
BDBM52468
NameBDBM52468
Synonyms:MLS000590213 N'-(2-phenylacetyl)pyrazine-2-carbohydrazide N'-(2-phenylethanoyl)pyrazine-2-carbohydrazide SMR000219336 | cid_947080
TypeSmall organic molecule
Emp. Form.C13H12N4O2
Mol. Mass.256.26
SMILESO=C(Cc1ccccc1)NNC(=O)c1cnccn1