Reaction Details
TargetZinc finger protein mex-5
LigandBDBM52469
Substrate/Competitorn/a
Meas. Tech.Fluorescent Polarization Homogeneous Dose Response HTS to Indentify Inhibitors of Mex-5 Binding to TCR-2
EC50 109390±n/a nM
Citation PubChem, PC Fluorescent Polarization Homogeneous Dose Response HTS to Indentify Inhibitors of Mex-5 Binding to TCR-2 PubChem Bioassay(2009)[AID]
 
Zinc finger protein mex-5
Name:Zinc finger protein mex-5
Type:Enzyme Catalytic Domain
Mol. Mass.:52832.78
Organism:Caenorhabditis elegans
Description:gi_55976631
Residue:468
BDBM52469
NameBDBM52469
Synonyms:(6Z)-5-azanylidene-6-[[1-[3-(3-methoxyphenoxy)propyl]indol-3-yl]methylidene]-2-methyl-[1,3]thiazolo[3,2-a]pyrimidin-7-one (6Z)-5-imino-6-[[1-[3-(3-methoxyphenoxy)propyl]indol-3-yl]methylene]-2-methyl-thiazolo[3,2-a]pyrimidin-7-one 5-Imino-6-[1-{1-[3-(3-methoxy-phenoxy)-propyl]-1H-indol-3-yl}-meth-(Z)-ylidene]-2-methyl-5,6-dihydro-thiazolo[3,2-a]pyrimidin-7-one SMR000220732 | cid_6516390
TypeSmall organic molecule
Emp. Form.C26H24N4O3S
Mol. Mass.472.559
SMILESCOc1cccc(OCCCn2cc(\C=C3/C(=O)N=C4SC(C)=CN4C3=N)c3ccccc23)c1