Reaction Details
TargetZinc finger protein mex-5
LigandBDBM51055
Substrate/Competitorn/a
Meas. Tech.Fluorescent Polarization Homogeneous Dose Response HTS to Indentify Inhibitors of Mex-5 Binding to TCR-2
EC50 4588±n/a nM
Citation PubChem, PC Fluorescent Polarization Homogeneous Dose Response HTS to Indentify Inhibitors of Mex-5 Binding to TCR-2 PubChem Bioassay(2009)[AID]
 
Zinc finger protein mex-5
Name:Zinc finger protein mex-5
Type:Enzyme Catalytic Domain
Mol. Mass.:52832.78
Organism:Caenorhabditis elegans
Description:gi_55976631
Residue:468
BDBM51055
NameBDBM51055
Synonyms:(E)-2-cyano-N-(2-methoxyphenyl)-3-(5-nitro-2-pyrrolidin-1-yl-phenyl)prop-2-enamide (E)-2-cyano-N-(2-methoxyphenyl)-3-(5-nitro-2-pyrrolidino-phenyl)acrylamide MLS000409077 cid_5917350
TypeSmall organic molecule
Emp. Form.C21H20N4O4
Mol. Mass.392.4079
SMILESCOc1ccccc1NC(=O)C(=C\c1cc(ccc1N1CCCC1)[N+]([O-])=O)\C#N