Reaction Details
TargetZinc finger protein mex-5
LigandBDBM50291
Substrate/Competitorn/a
Meas. Tech.Fluorescent Polarization Homogeneous Dose Response HTS to Indentify Inhibitors of Mex-5 Binding to TCR-2
EC50 300000±n/a nM
Citation PubChem, PC Fluorescent Polarization Homogeneous Dose Response HTS to Indentify Inhibitors of Mex-5 Binding to TCR-2 PubChem Bioassay(2009)[AID]
 
Zinc finger protein mex-5
Name:Zinc finger protein mex-5
Type:Enzyme Catalytic Domain
Mol. Mass.:52832.78
Organism:Caenorhabditis elegans
Description:gi_55976631
Residue:468
BDBM50291
NameBDBM50291
Synonyms:(5E)-5-[[5-(2-chlorophenyl)-2-furanyl]methylidene]-4-sulfanylidene-2-thiazolidinone (5E)-5-[[5-(2-chlorophenyl)furan-2-yl]methylidene]-4-sulfanylidene-1,3-thiazolidin-2-one SMR000235968 | cid_1576690
TypeSmall organic molecule
Emp. Form.C14H8ClNO2S2
Mol. Mass.321.802
SMILESOC1=NC(=S)C(S1)=Cc1ccc(o1)-c1ccccc1Cl