Reaction Details
TargetZinc finger protein mex-5
LigandBDBM52482
Substrate/Competitorn/a
Meas. Tech.Fluorescent Polarization Homogeneous Dose Response HTS to Indentify Inhibitors of Mex-5 Binding to TCR-2
EC50 300000±n/a nM
Citation PubChem, PC Fluorescent Polarization Homogeneous Dose Response HTS to Indentify Inhibitors of Mex-5 Binding to TCR-2 PubChem Bioassay(2009)[AID]
 
Zinc finger protein mex-5
Name:Zinc finger protein mex-5
Type:Enzyme Catalytic Domain
Mol. Mass.:52832.78
Organism:Caenorhabditis elegans
Description:gi_55976631
Residue:468
BDBM52482
NameBDBM52482
Synonyms:4-[2,5-dimethyl-3-[2-[2-(tosylamino)acetyl]oxyacetyl]pyrrol-1-yl]benzoic acid methyl ester MLS000393606 cid_2127943 methyl 4-[2,5-dimethyl-3-[2-[2-[(4-methylphenyl)sulfonylamino]ethanoyloxy]ethanoyl]pyrrol-1-yl]benzoate
TypeSmall organic molecule
Emp. Form.C25H26N2O7S
Mol. Mass.498.548
SMILESCOC(=O)c1ccc(cc1)-n1c(C)cc(C(=O)COC(=O)CNS(=O)(=O)c2ccc(C)cc2)c1C