Reaction Details
TargetZinc finger protein mex-5
LigandBDBM52486
Substrate/Competitorn/a
Meas. Tech.Fluorescent Polarization Homogeneous Dose Response HTS to Indentify Inhibitors of Mex-5 Binding to TCR-2
EC50 300000±n/a nM
Citation PubChem, PC Fluorescent Polarization Homogeneous Dose Response HTS to Indentify Inhibitors of Mex-5 Binding to TCR-2 PubChem Bioassay(2009)[AID]
 
Zinc finger protein mex-5
Name:Zinc finger protein mex-5
Type:Enzyme Catalytic Domain
Mol. Mass.:52832.78
Organism:Caenorhabditis elegans
Description:gi_55976631
Residue:468
BDBM52486
NameBDBM52486
Synonyms:3-(3-formyl-2,5-dimethyl-1-pyrrolyl)-2-methylbenzoic acid methyl ester MLS000680876 cid_818779 methyl 3-(3-formyl-2,5-dimethylpyrrol-1-yl)-2-methylbenzoate | methyl 3-(3-methanoyl-2,5-dimethyl-pyrrol-1-yl)-2-methyl-benzoate
TypeSmall organic molecule
Emp. Form.C16H17NO3
Mol. Mass.271.3111
SMILESCOC(=O)c1cccc(c1C)-n1c(C)cc(C=O)c1C