Reaction Details
TargetZinc finger protein mex-5
LigandBDBM52493
Substrate/Competitorn/a
Meas. Tech.Fluorescent Polarization Homogeneous Dose Response HTS to Indentify Inhibitors of Mex-5 Binding to TCR-2
EC50 3714±n/a nM
Citation PubChem, PC Fluorescent Polarization Homogeneous Dose Response HTS to Indentify Inhibitors of Mex-5 Binding to TCR-2 PubChem Bioassay(2009)[AID]
 
Zinc finger protein mex-5
Name:Zinc finger protein mex-5
Type:Enzyme Catalytic Domain
Mol. Mass.:52832.78
Organism:Caenorhabditis elegans
Description:gi_55976631
Residue:468
BDBM52493
NameBDBM52493
Synonyms:2,4-bis(chloranyl)-N-(2-methoxyphenazin-1-yl)benzamide 2,4-dichloro-N-(2-methoxyphenazin-1-yl)benzamide SMR000264963 | cid_4221279
TypeSmall organic molecule
Emp. Form.C20H13Cl2N3O2
Mol. Mass.398.242
SMILESCOc1ccc2nc3ccccc3nc2c1NC(=O)c1ccc(Cl)cc1Cl