Reaction Details
TargetZinc finger protein mex-5
LigandBDBM52500
Substrate/Competitorn/a
Meas. Tech.Fluorescent Polarization Homogeneous Dose Response HTS to Indentify Inhibitors of Mex-5 Binding to TCR-2
EC50 300000±n/a nM
Citation PubChem, PC Fluorescent Polarization Homogeneous Dose Response HTS to Indentify Inhibitors of Mex-5 Binding to TCR-2 PubChem Bioassay(2009)[AID]
 
Zinc finger protein mex-5
Name:Zinc finger protein mex-5
Type:Enzyme Catalytic Domain
Mol. Mass.:52832.78
Organism:Caenorhabditis elegans
Description:gi_55976631
Residue:468
BDBM52500
NameBDBM52500
Synonyms:3-(4-fluorophenyl)-1-phenyl-4-pyrazolecarboxylic acid [2-oxo-2-(4-sulfamoylanilino)ethyl] ester MLS000374593 [2-oxidanylidene-2-[(4-sulfamoylphenyl)amino]ethyl] 3-(4-fluorophenyl)-1-phenyl-pyrazole-4-carboxylate cid_2379848
TypeSmall organic molecule
Emp. Form.C24H19FN4O5S
Mol. Mass.494.495
SMILESNS(=O)(=O)c1ccc(NC(=O)COC(=O)c2cn(nc2-c2ccc(F)cc2)-c2ccccc2)cc1