Reaction Details
TargetPOsterior Segregation
LigandBDBM51295
Substrate/Competitorn/a
Meas. Tech.Fluorescent Polarization Homogeneous Dose Response HTS to Indentify Inhibitors of POS-1 Binding to mex-3-RNA
EC50 7850±n/a nM
Citation PubChem, PC Fluorescent Polarization Homogeneous Dose Response HTS to Indentify Inhibitors of POS-1 Binding to mex-3-RNA PubChem Bioassay(2009)[AID]
 
POsterior Segregation
Name:POsterior Segregation
Synonyms:POsterior Segregation family member (pos-1)
Type:Enzyme Catalytic Domain
Mol. Mass.:29838.90
Organism:Caenorhabditis elegans
Description:gi_17562800
Residue:264
BDBM51295
NameBDBM51295
TypeSmall organic molecule
Emp. Form.C10H7N5OS
Mol. Mass.245.26
SMILESNc1ccc2nc3c(nc2c1)[nH]c(=S)[nH]c3=O