Reaction Details
TargetPOsterior Segregation
LigandBDBM53091
Substrate/Competitorn/a
Meas. Tech.Fluorescent Polarization Homogeneous Dose Response HTS to Indentify Inhibitors of POS-1 Binding to mex-3-RNA
EC50 250239±n/a nM
Citation PubChem, PC Fluorescent Polarization Homogeneous Dose Response HTS to Indentify Inhibitors of POS-1 Binding to mex-3-RNA PubChem Bioassay(2009)[AID]
 
POsterior Segregation
Name:POsterior Segregation
Synonyms:POsterior Segregation family member (pos-1)
Type:Enzyme Catalytic Domain
Mol. Mass.:29838.90
Organism:Caenorhabditis elegans
Description:gi_17562800
Residue:264
BDBM53091
NameBDBM53091
TypeSmall organic molecule
Emp. Form.C12H9N3O6
Mol. Mass.291.2164
SMILESOc1[nH+]c(\C=C\[c-]2ccc(=O)c(O)c2)[nH]c(=O)c1[N+]([O-])=O