Reaction Details
TargetPOsterior Segregation
LigandBDBM31698
Substrate/Competitorn/a
Meas. Tech.Fluorescent Polarization Homogeneous Dose Response HTS to Indentify Inhibitors of POS-1 Binding to mex-3-RNA
EC50 300000±n/a nM
Citation PubChem, PC Fluorescent Polarization Homogeneous Dose Response HTS to Indentify Inhibitors of POS-1 Binding to mex-3-RNA PubChem Bioassay(2009)[AID]
 
POsterior Segregation
Name:POsterior Segregation
Synonyms:POsterior Segregation family member (pos-1)
Type:Enzyme Catalytic Domain
Mol. Mass.:29838.90
Organism:Caenorhabditis elegans
Description:gi_17562800
Residue:264
BDBM31698
NameBDBM31698
TypeSmall organic molecule
Emp. Form.C13H16BrNO3
Mol. Mass.314.175
SMILESCC1(C)CCCN(C1)C(=O)c1coc(=O)c(Br)c1