Reaction Details
TargetPOsterior Segregation
LigandBDBM52465
Substrate/Competitorn/a
Meas. Tech.Fluorescent Polarization Homogeneous Dose Response HTS to Indentify Inhibitors of POS-1 Binding to mex-3-RNA
EC50 103696±n/a nM
Citation PubChem, PC Fluorescent Polarization Homogeneous Dose Response HTS to Indentify Inhibitors of POS-1 Binding to mex-3-RNA PubChem Bioassay(2009)[AID]
 
POsterior Segregation
Name:POsterior Segregation
Synonyms:POsterior Segregation family member (pos-1)
Type:Enzyme Catalytic Domain
Mol. Mass.:29838.90
Organism:Caenorhabditis elegans
Description:gi_17562800
Residue:264
BDBM52465
NameBDBM52465
TypeSmall organic molecule
Emp. Form.C22H19N3O4
Mol. Mass.389.404
SMILESCOC(=O)C(=C\c1c(Oc2cc(C)cc(C)c2)nc2c(C)cccn2c1=O)\C#N