Reaction Details
TargetDual specificity protein phosphatase 6
LigandBDBM50102180
Substrate/Competitorn/a
Meas. Tech.MKP-3 in vitro HTS assay
IC50 3730±n/a nM
Citation PubChem, PC MKP-3 in vitro HTS assay PubChem Bioassay(2009)[AID]
 
Dual specificity protein phosphatase 6
Name:Dual specificity protein phosphatase 6
Type:Enzyme
Mol. Mass.:42303.19
Organism:Rattus norvegicus
Description:gi_16758752
Residue:381
BDBM50102180
NameBDBM50102180
Synonyms:CHEMBL57978 cid_86860
TypeSmall organic molecule
Emp. Form.C6H6O4
Mol. Mass.142.1094
SMILESOC(C(O)=O)c1ccco1