Reaction Details
TargetDual specificity protein phosphatase 6
LigandBDBM32050
Substrate/Competitorn/a
Meas. Tech.MKP-3 in vitro HTS assay
IC50 1190±n/a nM
Citation PubChem, PC MKP-3 in vitro HTS assay PubChem Bioassay(2009)[AID]
 
Dual specificity protein phosphatase 6
Name:Dual specificity protein phosphatase 6
Type:Enzyme
Mol. Mass.:42303.19
Organism:Rattus norvegicus
Description:gi_16758752
Residue:381
BDBM32050
NameBDBM32050
Synonyms:MLS000080844 cid_663844
TypeSmall organic molecule
Emp. Form.C20H16N4O2
Mol. Mass.344.3666
SMILESO=C1c2ccccc2-c2onc3ccc(NCCCn4ccnc4)c1c23