Reaction Details
TargetDual specificity protein phosphatase 6
LigandBDBM47086
Substrate/Competitorn/a
Meas. Tech.MKP-3 in vitro HTS assay
IC50 10000±n/a nM
Citation PubChem, PC MKP-3 in vitro HTS assay PubChem Bioassay(2009)[AID]
 
Dual specificity protein phosphatase 6
Name:Dual specificity protein phosphatase 6
Type:Enzyme
Mol. Mass.:42303.19
Organism:Rattus norvegicus
Description:gi_16758752
Residue:381
BDBM47086
NameBDBM47086
Synonyms:2-(3-methylanilino)-[1,3,4]thiadiazolo[2,3-b]quinazolin-5-one 2-[(3-methylphenyl)amino]-5H-[1,3,4]thiadiazolo[2,3-b]quinazolin-5-one MLS000095263 cid_3238944
TypeSmall organic molecule
Emp. Form.C16H12N4OS
Mol. Mass.308.358
SMILESCc1cccc(Nc2nn3c(nc4ccccc4c3=O)s2)c1