Reaction Details
TargetDual specificity protein phosphatase 6
LigandBDBM31755
Substrate/Competitorn/a
Meas. Tech.MKP-3 in vitro HTS assay
IC50 10000±n/a nM
Citation PubChem, PC MKP-3 in vitro HTS assay PubChem Bioassay(2009)[AID]
 
Dual specificity protein phosphatase 6
Name:Dual specificity protein phosphatase 6
Type:Enzyme
Mol. Mass.:42303.19
Organism:Rattus norvegicus
Description:gi_16758752
Residue:381
BDBM31755
NameBDBM31755
Synonyms:3-(benzylthio)-5,6-bis(2-furyl)-1,2,4-triazine 5,6-bis(2-furanyl)-3-(phenylmethylthio)-1,2,4-triazine MLS-0029114.0001 | cid_2940938
TypeSmall organic molecule
Emp. Form.C18H13N3O2S
Mol. Mass.335.38
SMILESC(Sc1nnc(-c2ccco2)c(n1)-c1ccco1)c1ccccc1