Reaction Details
TargetDual specificity protein phosphatase 6
LigandBDBM50143
Substrate/Competitorn/a
Meas. Tech.MKP-3 in vitro HTS assay
IC50 7900±n/a nM
Citation PubChem, PC MKP-3 in vitro HTS assay PubChem Bioassay(2009)[AID]
 
Dual specificity protein phosphatase 6
Name:Dual specificity protein phosphatase 6
Type:Enzyme
Mol. Mass.:42303.19
Organism:Rattus norvegicus
Description:gi_16758752
Residue:381
BDBM50143
NameBDBM50143
Synonyms:3-[2-({3-[2-(2,4-dimethylanilino)-2-oxoethyl]-2,4-dioxo-1,3-thiazolidin-5-ylidene}methyl)-1H-pyrrol-1-yl]benzoic acid 3-[2-[(Z)-[3-[2-(2,4-dimethylanilino)-2-oxoethyl]-2,4-dioxo-1,3-thiazolidin-5-ylidene]methyl]pyrrol-1-yl]benzoic acid 3-[2-[(Z)-[3-[2-[(2,4-dimethylphenyl)amino]-2-oxidanylidene-ethyl]-2,4-bis(oxidanylidene)-1,3-thiazolidin-5-ylidene]methyl]pyrrol-1-yl]benzoic acid MLS000540800 cid_11839290
TypeSmall organic molecule
Emp. Form.C25H21N3O5S
Mol. Mass.475.516
SMILESCc1ccc(NC(=O)CN2C(=O)S\C(=C/c3cccn3-c3cccc(c3)C(O)=O)C2=O)c(C)c1