Reaction Details
TargetDual specificity protein phosphatase 6
LigandBDBM46213
Substrate/Competitorn/a
Meas. Tech.MKP-3 in vitro HTS assay
IC50 72600±n/a nM
Citation PubChem, PC MKP-3 in vitro HTS assay PubChem Bioassay(2009)[AID]
 
Dual specificity protein phosphatase 6
Name:Dual specificity protein phosphatase 6
Type:Enzyme
Mol. Mass.:42303.19
Organism:Rattus norvegicus
Description:gi_16758752
Residue:381
BDBM46213
NameBDBM46213
Synonyms:2-[4-[[6-carbethoxy-3-keto-7-methyl-5-[4-(methylthio)phenyl]-5H-thiazolo[3,2-a]pyrimidin-2-ylidene]methyl]phenoxy]acetic acid 2-[4-[[6-ethoxycarbonyl-7-methyl-5-(4-methylsulfanylphenyl)-3-oxo-5H-[1,3]thiazolo[3,2-a]pyrimidin-2-ylidene]methyl]phenoxy]acetic acid ML120 cid_4302116
TypeSmall organic molecule
Emp. Form.C26H24N2O6S2
Mol. Mass.524.609
SMILESCCOC(=O)C1=C(C)N=c2sc(=Cc3ccc(OCC(O)=O)cc3)c(=O)n2C1c1ccc(SC)cc1