Reaction Details
TargetTyrosine-protein phosphatase non-receptor type 7
LigandBDBM31755
Substrate/Competitorn/a
Meas. Tech.HTS Discovery of Chemical Inhibitors of HePTP, a Leukemia Target
IC50 2740±n/a nM
Citation PubChem, PC HTS Discovery of Chemical Inhibitors of HePTP, a Leukemia Target PubChem Bioassay(2008)[AID]
 
Tyrosine-protein phosphatase non-receptor type 7
Name:Tyrosine-protein phosphatase non-receptor type 7
Type:Protein
Mol. Mass.:40530.79
Organism:Homo sapiens (Human)
Description:P35236
Residue:360
BDBM31755
NameBDBM31755
Synonyms:3-(benzylthio)-5,6-bis(2-furyl)-1,2,4-triazine 5,6-bis(2-furanyl)-3-(phenylmethylthio)-1,2,4-triazine MLS-0029114.0001 | cid_2940938
TypeSmall organic molecule
Emp. Form.C18H13N3O2S
Mol. Mass.335.38
SMILESC(Sc1nnc(-c2ccco2)c(n1)-c1ccco1)c1ccccc1