Reaction Details
TargetHeat shock cognate 71 kDa protein
LigandBDBM31690
Substrate/Competitorn/a
Meas. Tech.High Throughput Screening Assay for Hsc70 Inhibitors
IC50 999000±n/a nM
Citation PubChem, PC High Throughput Screening Assay for Hsc70 Inhibitors PubChem Bioassay(2007)[AID]
 
Heat shock cognate 71 kDa protein
Name:Heat shock cognate 71 kDa protein
Type:Enzyme Catalytic Domain
Mol. Mass.:70887.67
Organism:Homo sapiens (Human)
Description:gi_5729877
Residue:646
BDBM31690
NameBDBM31690
Synonyms:5-(2,4-Dichloro-phenyl)-7-furan-2-yl-4,5,6,7-tetrahydro-[1,2,4]triazolo[1,5-a]pyrimidin-2-ylamine 5-(2,4-dichlorophenyl)-7-(furan-2-yl)-1,5,6,7-tetrahydro-[1,2,4]triazolo[1,5-a]pyrimidin-2-amine SMR000013928 cid_5308450
TypeSmall organic molecule
Emp. Form.C15H13Cl2N5O
Mol. Mass.350.203
SMILESNc1nc2NC(CC(c3ccco3)n2n1)c1ccc(Cl)cc1Cl