Reaction Details
TargetHeat shock cognate 71 kDa protein
LigandBDBM31697
Substrate/Competitorn/a
Meas. Tech.High Throughput Screening Assay for Hsc70 Inhibitors
IC50 999000±n/a nM
Citation PubChem, PC High Throughput Screening Assay for Hsc70 Inhibitors PubChem Bioassay(2007)[AID]
 
Heat shock cognate 71 kDa protein
Name:Heat shock cognate 71 kDa protein
Type:Enzyme Catalytic Domain
Mol. Mass.:70887.67
Organism:Homo sapiens (Human)
Description:gi_5729877
Residue:646
BDBM31697
NameBDBM31697
Synonyms:4-[4-[2-(4-methylphenoxy)ethyl]-1-piperazinyl]-N-(5-methyl-1,3,4-thiadiazol-2-yl)-4-oxobutanamide 4-[4-[2-(4-methylphenoxy)ethyl]piperazin-1-yl]-N-(5-methyl-1,3,4-thiadiazol-2-yl)-4-oxobutanamide MLS000082798 cid_663757
TypeSmall organic molecule
Emp. Form.C20H27N5O3S
Mol. Mass.417.525
SMILESCc1nnc(NC(=O)CCC(=O)N2CCN(CCOc3ccc(C)cc3)CC2)s1