Reaction Details
TargetHeat shock cognate 71 kDa protein
LigandBDBM31701
Substrate/Competitorn/a
Meas. Tech.High Throughput Screening Assay for Hsc70 Inhibitors
IC50 999000±n/a nM
Citation PubChem, PC High Throughput Screening Assay for Hsc70 Inhibitors PubChem Bioassay(2007)[AID]
 
Heat shock cognate 71 kDa protein
Name:Heat shock cognate 71 kDa protein
Type:Enzyme Catalytic Domain
Mol. Mass.:70887.67
Organism:Homo sapiens (Human)
Description:gi_5729877
Residue:646
BDBM31701
NameBDBM31701
Synonyms:3-(2-furanyl)-N-(3-methoxypropyl)-3-[(4-methylphenyl)sulfonylamino]propanamide 3-(2-furyl)-N-(3-methoxypropyl)-3-{[(4-methylphenyl)sulfonyl]amino}propanamide MLS000047323 cid_3239172
TypeSmall organic molecule
Emp. Form.C18H24N2O5S
Mol. Mass.380.459
SMILESCOCCCNC(=O)CC(NS(=O)(=O)c1ccc(C)cc1)c1ccco1