Reaction Details
TargetHeat shock cognate 71 kDa protein
LigandBDBM31708
Substrate/Competitorn/a
Meas. Tech.High Throughput Screening Assay for Hsc70 Inhibitors
IC50 999000±n/a nM
Citation PubChem, PC High Throughput Screening Assay for Hsc70 Inhibitors PubChem Bioassay(2007)[AID]
 
Heat shock cognate 71 kDa protein
Name:Heat shock cognate 71 kDa protein
Type:Enzyme Catalytic Domain
Mol. Mass.:70887.67
Organism:Homo sapiens (Human)
Description:gi_5729877
Residue:646
BDBM31708
NameBDBM31708
Synonyms:MLS000118949 N-(5-methyl-1,2-oxazol-3-yl)-2-quinazolin-4-ylsulfanylacetamide N-(5-methylisoxazol-3-yl)-2-(quinazolin-4-ylthio)acetamide cid_2607885
TypeSmall organic molecule
Emp. Form.C14H12N4O2S
Mol. Mass.300.336
SMILESCc1cc(NC(=O)CSc2ncnc3ccccc23)no1