Reaction Details
TargetHeat shock cognate 71 kDa protein
LigandBDBM31717
Substrate/Competitorn/a
Meas. Tech.High Throughput Screening Assay for Hsc70 Inhibitors
IC50 999000±n/a nM
Citation PubChem, PC High Throughput Screening Assay for Hsc70 Inhibitors PubChem Bioassay(2007)[AID]
 
Heat shock cognate 71 kDa protein
Name:Heat shock cognate 71 kDa protein
Type:Enzyme Catalytic Domain
Mol. Mass.:70887.67
Organism:Homo sapiens (Human)
Description:gi_5729877
Residue:646
BDBM31717
NameBDBM31717
Synonyms:MLS000521411 [4-[(2-hydroxybenzoyl)diazenyl]anilino] benzoate benzoic acid (4-salicyloylazoanilino) ester cid_4483668
TypeSmall organic molecule
Emp. Form.C20H15N3O4
Mol. Mass.361.3508
SMILESOc1ccccc1C(=O)\N=N\c1ccc(NOC(=O)c2ccccc2)cc1