Reaction Details
TargetM1 family aminopeptidase
LigandBDBM36880
Substrate/Competitorn/a
Meas. Tech.Inhibitors of Plasmodium falciparum M1- Family Alanyl Aminopeptidase (M1AAP)
IC50 42880±n/a nM
Citation PubChem, PC Inhibitors of Plasmodium falciparum M1- Family Alanyl Aminopeptidase (M1AAP) PubChem Bioassay(2008)[AID]
 
M1 family aminopeptidase
Name:M1 family aminopeptidase
Type:PROTEIN
Mol. Mass.:126072.31
Organism:Plasmodium falciparum (isolate FcB1 / Columbia)
Description:ChEMBL_735637
Residue:1085
BDBM36880
NameBDBM36880
Synonyms:2,2'-THIOBIS(4,6-DICHLOROPHENOL) 2,4-dichloro-6-[(3,5-dichloro-2-hydroxy-phenyl)thio]phenol 2-[3,5-bis(chloranyl)-2-oxidanyl-phenyl]sulfanyl-4,6-bis(chloranyl)phenol HL-3 SMR000058374 | cid_2406
TypeSmall organic molecule
Emp. Form.C12H6Cl4O2S
Mol. Mass.356.052
SMILESOc1c(Cl)cc(Cl)cc1Sc1cc(Cl)cc(Cl)c1O