Reaction Details
TargetM1 family aminopeptidase
LigandBDBM31712
Substrate/Competitorn/a
Meas. Tech.Inhibitors of Plasmodium falciparum M1- Family Alanyl Aminopeptidase (M1AAP)
IC50 57990±n/a nM
Citation PubChem, PC Inhibitors of Plasmodium falciparum M1- Family Alanyl Aminopeptidase (M1AAP) PubChem Bioassay(2008)[AID]
 
M1 family aminopeptidase
Name:M1 family aminopeptidase
Type:PROTEIN
Mol. Mass.:126072.31
Organism:Plasmodium falciparum (isolate FcB1 / Columbia)
Description:ChEMBL_735637
Residue:1085
BDBM31712
NameBDBM31712
Synonyms:HEXACHLOROPHENE MLS000028433 cid_3598
TypeSmall organic molecule
Emp. Form.C13H6Cl6O2
Mol. Mass.406.904
SMILESOc1c(Cl)cc(Cl)c(Cl)c1Cc1c(O)c(Cl)cc(Cl)c1Cl