Reaction Details
TargetM1 family aminopeptidase
LigandBDBM54140
Substrate/Competitorn/a
Meas. Tech.Inhibitors of Plasmodium falciparum M1- Family Alanyl Aminopeptidase (M1AAP)
IC50 11230±n/a nM
Citation PubChem, PC Inhibitors of Plasmodium falciparum M1- Family Alanyl Aminopeptidase (M1AAP) PubChem Bioassay(2008)[AID]
 
M1 family aminopeptidase
Name:M1 family aminopeptidase
Type:PROTEIN
Mol. Mass.:126072.31
Organism:Plasmodium falciparum (isolate FcB1 / Columbia)
Description:ChEMBL_735637
Residue:1085
BDBM54140
NameBDBM54140
Synonyms:MLS001043248 N-[(5Z)-4-oxidanylidene-5-(2-oxidanylidene-1H-indol-3-ylidene)-2-sulfanylidene-1,3-thiazolidin-3-yl]benzamide N-[(5Z)-4-oxo-5-(2-oxo-1H-indol-3-ylidene)-2-sulfanylidene-3-thiazolidinyl]benzamide SMR000425314 | cid_5457058
TypeSmall organic molecule
Emp. Form.C18H11N3O3S2
Mol. Mass.381.428
SMILESO=C(NN1C(=S)S\C(C1=O)=C1/C(=O)Nc2ccccc12)c1ccccc1