Reaction Details
TargetNucleotide-binding oligomerization domain-containing protein 2
LigandBDBM46401
Substrate/Competitorn/a
Meas. Tech.uHTS luminescence assay for the identification of compounds that inhibit NOD2 in MDP treated cells
IC50 233±n/a nM
Citation PubChem, PC uHTS luminescence assay for the identification of compounds that inhibit NOD2 in MDP treated cells PubChem Bioassay(2010)[AID]
 
Nucleotide-binding oligomerization domain-containing protein 2
Name:Nucleotide-binding oligomerization domain-containing protein 2
Type:PROTEIN
Mol. Mass.:115287.18
Organism:Homo sapiens (Human)
Description:ChEMBL_1454053
Residue:1040
BDBM46401
NameBDBM46401
Synonyms:1-(2-nitrophenyl)-3-[[(E)-(6-oxidanylidene-4-propoxy-cyclohexa-2,4-dien-1-ylidene)methyl]amino]thiourea 1-(2-nitrophenyl)-3-[[(E)-(6-oxo-4-propoxycyclohexa-2,4-dien-1-ylidene)methyl]amino]thiourea MLS000393335 cid_5831714
TypeSmall organic molecule
Emp. Form.C17H18N4O4S
Mol. Mass.374.414
SMILESCCCOc1cc[c-](C=[NH+]NC(=S)Nc2ccccc2[N+]([O-])=O)c(=O)c1