Reaction Details
TargetNucleotide-binding oligomerization domain-containing protein 2
LigandBDBM54356
Substrate/Competitorn/a
Meas. Tech.uHTS luminescence assay for the identification of compounds that inhibit NOD2 in MDP treated cells
IC50 36±n/a nM
Citation PubChem, PC uHTS luminescence assay for the identification of compounds that inhibit NOD2 in MDP treated cells PubChem Bioassay(2010)[AID]
 
Nucleotide-binding oligomerization domain-containing protein 2
Name:Nucleotide-binding oligomerization domain-containing protein 2
Type:PROTEIN
Mol. Mass.:115287.18
Organism:Homo sapiens (Human)
Description:ChEMBL_1454053
Residue:1040
BDBM54356
NameBDBM54356
Synonyms:2-bromobenzoic acid [2-[2,5-dimethyl-1-(2-oxolanylmethyl)-3-pyrrolyl]-2-oxoethyl] ester MLS001033592 [2-[2,5-dimethyl-1-(oxolan-2-ylmethyl)pyrrol-3-yl]-2-oxidanylidene-ethyl] 2-bromanylbenzoate cid_5057111
TypeSmall organic molecule
Emp. Form.C20H22BrNO4
Mol. Mass.420.297
SMILESCc1cc(C(=O)COC(=O)c2ccccc2Br)c(C)n1CC1CCCO1